{"text_format":"1","workbook":"xlsx","n_sheets":4,"sheets":["infos échantillons","Ressource","Version","Feuil1"],"not_rendered":{"charts":0,"images":0,"macros":0,"external_links":0,"defined_names":10,"comments":1,"pivot_tables":0},"unopened":[],"bounds":{"document_bytes":16777216,"sheet_cells":100000,"rows_first":2000,"rows_last":500,"rows_between":2000,"halvings":0,"cell_chars":16384,"cell_head_chars":4096},"cells_cut":0,"cells_raw":0,"read":"whole","date_system":"1900"}

{"sheet":"infos échantillons","index":0,"n_rows":2812,"n_cols":16,"rows_kept":2812,"cut":false,"hidden":false,"merged":[[18,1,18,2],[19,1,19,2],[20,1,20,2],[0,4,0,9],[0,0,0,3],[2,3,2,4],[2,1,2,2],[22,1,22,2],[26,0,26,15],[2,5,2,6],[16,5,16,9],[21,1,21,2],[17,1,17,2],[14,1,14,2],[15,1,15,2],[24,1,24,2],[11,1,11,3],[12,1,12,3],[13,1,13,2],[11,5,12,9],[16,1,16,2],[23,1,23,2],[17,5,17,9]]}
["Sample sheet for the project: "]
[]
[null," DNA prerequisites  \n(with PCR amplification)",null,"Pré-requis ADN PCRfree\n (sans amplification PCR)",null," Pré-requis ADN EMseq\n"]
[null,"Min. quantity of matrix :","500 ng","Min. quantity of matrix :","4µg","Min. quantity of matrix :","500 ng"]
[null,"Min. concentration:","5 ng/µl","Min. concentration:","20 ng/µl","Min. concentration:","5 ng/µl"]
[null,"Purity 260/280 :","1,8","Purity  260/280 :","1,8","Purity  260/280 :","1,8"]
[null,"Minimum volume: ","20 µl","Minimum volume: ","20 µl","Minimum volume: ","20 µl"]
[]
[]
[null,"See the Prerequisites sheet for more information."]
[]
[null,"To be completed by the research team",null,null,null,"Please do not change the position of the columns or their titles."]
[]
[null,"Matrix type",null,null,{"$f":"IFERROR(INDEX(Ressource!A3:B11,MATCH(D14,Ressource!A3:A11,0),2),\"\")","v":""}]
[null,"Type of library",null,null,{"$f":"IFERROR(INDEX(Ressource!E3:F38,MATCH(D15,Ressource!E3:E38,0),2),\"\")","v":""},"a If your samples do not meet the prerequisites, please contact the platform."]
[null,"Library selection",null,null,{"$f":"IFERROR(INDEX(Ressource!C3:D33,MATCH(D16,Ressource!C3:C33,0),2),\"\")","v":""}]
[null,"Species (scientific name)",null,null,null,"* If your sample container (tube, plate) has a barcode, please specify this in the Barcode column."]
[null,"Extraction method",null,null,null,"* Choose short sample names without special characters (spaces, commas, full stops, underscores, etc.), except for hyphens, which are permitted."]
[null,"Elution",null,null,null,"* Check that the name on the tube matches the name in the file."]
[null,"Number of samples",null,null,null,"* In order to perform quality analyses on your data, please provide us with the web link to the reference genome and its version."]
[null,"Number of lanes"]
[null,"Multiplexing",null,"n-plex / non"]
[null,"Storing my samples",null,"Non"]
[]
[null,"Reference/Reference genome link(NCBI/Ensembl, etc.)"]
[]
["Sample information to be provided by the research team"]
[null,"Support","plate well","Barcode","Sample Name","Species (scientific name)","Nanodrop concentration estimation (ng/µl)","ratio 260/280","ratio 260/230","RIN","QuBit  or Picogreen dosage (ng/µl)","Volume (µl)","Quantity supplied (µg)","Matrix type","Type of library","Library selection"]
[1,null,"A01",null,null,{"$f":"IF($D$17<>\"\",$D$17,\"\")","v":""},null,null,null,null,null,null,null,{"$f":"IF($D$14<>\"\",$D$14,\"\")","v":""},{"$f":"IF($D$15<>\"\",$D$15,\"\")","v":""},{"$f":"IF($D$16<>\"\",$D$16,\"\")","v":""}]
[2,null,"B01",null,null,{"$f":"IF($D$17<>\"\",$D$17,\"\")","v":""},null,null,null,null,null,null,null,{"$f":"IF($D$14<>\"\",$D$14,\"\")","v":""},{"$f":"IF($D$15<>\"\",$D$15,\"\")","v":""},{"$f":"IF($D$16<>\"\",$D$16,\"\")","v":""}]
[3,null,"C01",null,null,"",null,null,null,null,null,null,null,"","",""]
[4,null,"D01",null,null,"",null,null,null,null,null,null,null,"","",""]
[5,null,"E01",null,null,"",null,null,null,null,null,null,null,"","",""]
[6,null,"F01",null,null,"",null,null,null,null,null,null,null,"","",""]
[7,null,"G01",null,null,"",null,null,null,null,null,null,null,"","",""]
[8,null,"H01",null,null,"",null,null,null,null,null,null,null,"","",""]
[9,null,"A02",null,null,"",null,null,null,null,null,null,null,"","",""]
[10,null,"B02",null,null,"",null,null,null,null,null,null,null,"","",""]
[11,null,"C02",null,null,"",null,null,null,null,null,null,null,"","",""]
[12,null,"D02",null,null,"",null,null,null,null,null,null,null,"","",""]
[13,null,"E02",null,null,"",null,null,null,null,null,null,null,"","",""]
[14,null,"F02",null,null,"",null,null,null,null,null,null,null,"","",""]
[15,null,"G02",null,null,"",null,null,null,null,null,null,null,"","",""]
[16,null,"H02",null,null,"",null,null,null,null,null,null,null,"","",""]
[17,null,"A03",null,null,"",null,null,null,null,null,null,null,"","",""]
[18,null,"B03",null,null,"",null,null,null,null,null,null,null,"","",""]
[19,null,"C03",null,null,"",null,null,null,null,null,null,null,"","",""]
[20,null,"D03",null,null,"",null,null,null,null,null,null,null,"","",""]
[21,null,"E03",null,null,"",null,null,null,null,null,null,null,"","",""]
[22,null,"F03",null,null,"",null,null,null,null,null,null,null,"","",""]
[23,null,"G03",null,null,"",null,null,null,null,null,null,null,"","",""]
[24,null,"H03",null,null,"",null,null,null,null,null,null,null,"","",""]
[25,null,"A04",null,null,"",null,null,null,null,null,null,null,"","",""]
[26,null,"B04",null,null,"",null,null,null,null,null,null,null,"","",""]
[27,null,"C04",null,null,"",null,null,null,null,null,null,null,"","",""]
[28,null,"D04",null,null,"",null,null,null,null,null,null,null,"","",""]
[29,null,"E04",null,null,"",null,null,null,null,null,null,null,"","",""]
[30,null,"F04",null,null,"",null,null,null,null,null,null,null,"","",""]
[31,null,"G04",null,null,"",null,null,null,null,null,null,null,"","",""]
[32,null,"H04",null,null,"",null,null,null,null,null,null,null,"","",""]
[33,null,"A05",null,null,"",null,null,null,null,null,null,null,"","",""]
[34,null,"B05",null,null,"",null,null,null,null,null,null,null,"","",""]
[35,null,"C05",null,null,"",null,null,null,null,null,null,null,"","",""]
[36,null,"D05",null,null,"",null,null,null,null,null,null,null,"","",""]
[37,null,"E05",null,null,"",null,null,null,null,null,null,null,"","",""]
[38,null,"F05",null,null,"",null,null,null,null,null,null,null,"","",""]
[39,null,"G05",null,null,"",null,null,null,null,null,null,null,"","",""]
[40,null,"H05",null,null,"",null,null,null,null,null,null,null,"","",""]
[41,null,"A06",null,null,"",null,null,null,null,null,null,null,"","",""]
[42,null,"B06",null,null,"",null,null,null,null,null,null,null,"","",""]
[43,null,"C06",null,null,"",null,null,null,null,null,null,null,"","",""]
[44,null,"D06",null,null,"",null,null,null,null,null,null,null,"","",""]
[45,null,"E06",null,null,"",null,null,null,null,null,null,null,"","",""]
[46,null,"F06",null,null,"",null,null,null,null,null,null,null,"","",""]
[47,null,"G06",null,null,"",null,null,null,null,null,null,null,"","",""]
[48,null,"H06",null,null,"",null,null,null,null,null,null,null,"","",""]
[49,null,"A07",null,null,"",null,null,null,null,null,null,null,"","",""]
[50,null,"B07",null,null,"",null,null,null,null,null,null,null,"","",""]
[51,null,"C07",null,null,"",null,null,null,null,null,null,null,"","",""]
[52,null,"D07",null,null,"",null,null,null,null,null,null,null,"","",""]
[53,null,"E07",null,null,"",null,null,null,null,null,null,null,"","",""]
[54,null,"F07",null,null,"",null,null,null,null,null,null,null,"","",""]
[55,null,"G07",null,null,"",null,null,null,null,null,null,null,"","",""]
[56,null,"H07",null,null,"",null,null,null,null,null,null,null,"","",""]
[57,null,"A08",null,null,"",null,null,null,null,null,null,null,"","",""]
[58,null,"B08",null,null,"",null,null,null,null,null,null,null,"","",""]
[59,null,"C08",null,null,"",null,null,null,null,null,null,null,"","",""]
[60,null,"D08",null,null,"",null,null,null,null,null,null,null,"","",""]
[61,null,"E08",null,null,"",null,null,null,null,null,null,null,"","",""]
[62,null,"F08",null,null,"",null,null,null,null,null,null,null,"","",""]
[63,null,"G08",null,null,"",null,null,null,null,null,null,null,"","",""]
[64,null,"H08",null,null,"",null,null,null,null,null,null,null,"","",""]
[65,null,"A09",null,null,"",null,null,null,null,null,null,null,"","",""]
[66,null,"B09",null,null,{"$f":"IF($D$17<>\"\",$D$17,\"\")","v":""},null,null,null,null,null,null,null,{"$f":"IF($D$14<>\"\",$D$14,\"\")","v":""},{"$f":"IF($D$15<>\"\",$D$15,\"\")","v":""},{"$f":"IF($D$16<>\"\",$D$16,\"\")","v":""}]
[67,null,"C09",null,null,"",null,null,null,null,null,null,null,"","",""]
[68,null,"D09",null,null,"",null,null,null,null,null,null,null,"","",""]
[69,null,"E09",null,null,"",null,null,null,null,null,null,null,"","",""]
[70,null,"F09",null,null,"",null,null,null,null,null,null,null,"","",""]
[71,null,"G09",null,null,"",null,null,null,null,null,null,null,"","",""]
[72,null,"H09",null,null,"",null,null,null,null,null,null,null,"","",""]
[73,null,"A10",null,null,"",null,null,null,null,null,null,null,"","",""]
[74,null,"B10",null,null,"",null,null,null,null,null,null,null,"","",""]
[75,null,"C10",null,null,"",null,null,null,null,null,null,null,"","",""]
[76,null,"D10",null,null,"",null,null,null,null,null,null,null,"","",""]
[77,null,"E10",null,null,"",null,null,null,null,null,null,null,"","",""]
[78,null,"F10",null,null,"",null,null,null,null,null,null,null,"","",""]
[79,null,"G10",null,null,"",null,null,null,null,null,null,null,"","",""]
[80,null,"H10",null,null,"",null,null,null,null,null,null,null,"","",""]
[81,null,"A11",null,null,"",null,null,null,null,null,null,null,"","",""]
[82,null,"B11",null,null,"",null,null,null,null,null,null,null,"","",""]
[83,null,"C11",null,null,"",null,null,null,null,null,null,null,"","",""]
[84,null,"D11",null,null,"",null,null,null,null,null,null,null,"","",""]
[85,null,"E11",null,null,"",null,null,null,null,null,null,null,"","",""]
[86,null,"F11",null,null,"",null,null,null,null,null,null,null,"","",""]
[87,null,"G11",null,null,"",null,null,null,null,null,null,null,"","",""]
[88,null,"H11",null,null,"",null,null,null,null,null,null,null,"","",""]
[89,null,"A12",null,null,"",null,null,null,null,null,null,null,"","",""]
[90,null,"B12",null,null,"",null,null,null,null,null,null,null,"","",""]
[91,null,"C12",null,null,"",null,null,null,null,null,null,null,"","",""]
[92,null,"D12",null,null,"",null,null,null,null,null,null,null,"","",""]
[93,null,"E12",null,null,"",null,null,null,null,null,null,null,"","",""]
[94,null,"F12",null,null,"",null,null,null,null,null,null,null,"","",""]
[95,null,"G12",null,null,"",null,null,null,null,null,null,null,"","",""]
[96,null,"H12",null,null,"",null,null,null,null,null,null,null,"","",""]
[97,null,"A01",null,null,"",null,null,null,null,null,null,null,"","",""]
[98,null,"B01",null,null,"",null,null,null,null,null,null,null,"","",""]
[99,null,"C01",null,null,"",null,null,null,null,null,null,null,"","",""]
[100,null,"D01",null,null,"",null,null,null,null,null,null,null,"","",""]
[101,null,"E01",null,null,"",null,null,null,null,null,null,null,"","",""]
[102,null,"F01",null,null,"",null,null,null,null,null,null,null,"","",""]
[103,null,"G01",null,null,"",null,null,null,null,null,null,null,"","",""]
[104,null,"H01",null,null,"",null,null,null,null,null,null,null,"","",""]
[105,null,"A02",null,null,"",null,null,null,null,null,null,null,"","",""]
[106,null,"B02",null,null,"",null,null,null,null,null,null,null,"","",""]
[107,null,"C02",null,null,"",null,null,null,null,null,null,null,"","",""]
[108,null,"D02",null,null,"",null,null,null,null,null,null,null,"","",""]
[109,null,"E02",null,null,"",null,null,null,null,null,null,null,"","",""]
[110,null,"F02",null,null,"",null,null,null,null,null,null,null,"","",""]
[111,null,"G02",null,null,"",null,null,null,null,null,null,null,"","",""]
[112,null,"H02",null,null,"",null,null,null,null,null,null,null,"","",""]
[113,null,"A03",null,null,"",null,null,null,null,null,null,null,"","",""]
[114,null,"B03",null,null,"",null,null,null,null,null,null,null,"","",""]
[115,null,"C03",null,null,"",null,null,null,null,null,null,null,"","",""]
[116,null,"D03",null,null,"",null,null,null,null,null,null,null,"","",""]
[117,null,"E03",null,null,"",null,null,null,null,null,null,null,"","",""]
[118,null,"F03",null,null,"",null,null,null,null,null,null,null,"","",""]
[119,null,"G03",null,null,"",null,null,null,null,null,null,null,"","",""]
[120,null,"H03",null,null,"",null,null,null,null,null,null,null,"","",""]
[121,null,"A04",null,null,"",null,null,null,null,null,null,null,"","",""]
[122,null,"B04",null,null,"",null,null,null,null,null,null,null,"","",""]
[123,null,"C04",null,null,"",null,null,null,null,null,null,null,"","",""]
[124,null,"D04",null,null,"",null,null,null,null,null,null,null,"","",""]
[125,null,"E04",null,null,"",null,null,null,null,null,null,null,"","",""]
[126,null,"F04",null,null,"",null,null,null,null,null,null,null,"","",""]
[127,null,"G04",null,null,"",null,null,null,null,null,null,null,"","",""]
[128,null,"H04",null,null,"",null,null,null,null,null,null,null,"","",""]
[129,null,"A05",null,null,"",null,null,null,null,null,null,null,"","",""]
[130,null,"B05",null,null,{"$f":"IF($D$17<>\"\",$D$17,\"\")","v":""},null,null,null,null,null,null,null,{"$f":"IF($D$14<>\"\",$D$14,\"\")","v":""},{"$f":"IF($D$15<>\"\",$D$15,\"\")","v":""},{"$f":"IF($D$16<>\"\",$D$16,\"\")","v":""}]
[131,null,"C05",null,null,"",null,null,null,null,null,null,null,"","",""]
[132,null,"D05",null,null,"",null,null,null,null,null,null,null,"","",""]
[133,null,"E05",null,null,"",null,null,null,null,null,null,null,"","",""]
[134,null,"F05",null,null,"",null,null,null,null,null,null,null,"","",""]
[135,null,"G05",null,null,"",null,null,null,null,null,null,null,"","",""]
[136,null,"H05",null,null,"",null,null,null,null,null,null,null,"","",""]
[137,null,"A06",null,null,"",null,null,null,null,null,null,null,"","",""]
[138,null,"B06",null,null,"",null,null,null,null,null,null,null,"","",""]
[139,null,"C06",null,null,"",null,null,null,null,null,null,null,"","",""]
[140,null,"D06",null,null,"",null,null,null,null,null,null,null,"","",""]
[141,null,"E06",null,null,"",null,null,null,null,null,null,null,"","",""]
[142,null,"F06",null,null,"",null,null,null,null,null,null,null,"","",""]
[143,null,"G06",null,null,"",null,null,null,null,null,null,null,"","",""]
[144,null,"H06",null,null,"",null,null,null,null,null,null,null,"","",""]
[145,null,"A07",null,null,"",null,null,null,null,null,null,null,"","",""]
[146,null,"B07",null,null,"",null,null,null,null,null,null,null,"","",""]
[147,null,"C07",null,null,"",null,null,null,null,null,null,null,"","",""]
[148,null,"D07",null,null,"",null,null,null,null,null,null,null,"","",""]
[149,null,"E07",null,null,"",null,null,null,null,null,null,null,"","",""]
[150,null,"F07",null,null,"",null,null,null,null,null,null,null,"","",""]
[151,null,"G07",null,null,"",null,null,null,null,null,null,null,"","",""]
[152,null,"H07",null,null,"",null,null,null,null,null,null,null,"","",""]
[153,null,"A08",null,null,"",null,null,null,null,null,null,null,"","",""]
[154,null,"B08",null,null,"",null,null,null,null,null,null,null,"","",""]
[155,null,"C08",null,null,"",null,null,null,null,null,null,null,"","",""]
[156,null,"D08",null,null,"",null,null,null,null,null,null,null,"","",""]
[157,null,"E08",null,null,"",null,null,null,null,null,null,null,"","",""]
[158,null,"F08",null,null,"",null,null,null,null,null,null,null,"","",""]
[159,null,"G08",null,null,"",null,null,null,null,null,null,null,"","",""]
[160,null,"H08",null,null,"",null,null,null,null,null,null,null,"","",""]
[161,null,"A09",null,null,"",null,null,null,null,null,null,null,"","",""]
[162,null,"B09",null,null,"",null,null,null,null,null,null,null,"","",""]
[163,null,"C09",null,null,"",null,null,null,null,null,null,null,"","",""]
[164,null,"D09",null,null,"",null,null,null,null,null,null,null,"","",""]
[165,null,"E09",null,null,"",null,null,null,null,null,null,null,"","",""]
[166,null,"F09",null,null,"",null,null,null,null,null,null,null,"","",""]
[167,null,"G09",null,null,"",null,null,null,null,null,null,null,"","",""]
[168,null,"H09",null,null,"",null,null,null,null,null,null,null,"","",""]
[169,null,"A10",null,null,"",null,null,null,null,null,null,null,"","",""]
[170,null,"B10",null,null,"",null,null,null,null,null,null,null,"","",""]
[171,null,"C10",null,null,"",null,null,null,null,null,null,null,"","",""]
[172,null,"D10",null,null,"",null,null,null,null,null,null,null,"","",""]
{"$rows_left_out":2613}
{"sheet":"Ressource","index":1,"n_rows":38,"n_cols":6,"rows_kept":38,"cut":false,"hidden":false,"merged":[[0,0,0,1],[0,2,0,3],[0,4,0,5]]}
["Type of DNA or RNA used in the experiment",null,"Whether the source material was selected for certain properties (for\nexample methyl filtrated)",null,"the sequencing technique intended for the library."]
["library source","library source explanation","library selection","library selection explanation","Library strategy","Library strategy explanation"]
["GENOMIC"," Genomic DNA (includes PCR products from genomic DNA).","RANDOM"," No Selection or Random selection","WGS"," Whole Genome Sequencing - random sequencing of the whole genome (see pubmed 10731132 for details)"]
["GENOMIC SINGLE CELL","No description","PCR"," target enrichment via PCR","WGA"," Whole Genome Amplification followed by random sequencing. (see pubmed 1631067,8962113 for details)"]
["TRANSCRIPTOMIC"," Transcription products or non genomic DNA (EST, cDNA, RT-PCR, screened libraries).","RANDOM PCR"," Source material was selected by randomly generated primers.","WXS"," Random sequencing of exonic regions selected from the genome. (see pubmed 20111037 for details)"]
["TRANSCRIPTOMIC SINGLE CELL","No description","RT-PCR"," target enrichment via","RNA-Seq"," Random sequencing of whole transcriptome, also known as Whole Transcriptome Shotgun Sequencing, or WTSS). (see pubmed 18611170 for details)"]
["METAGENOMIC"," Mixed material from metagenome.","HMPR"," Hypo-methylated partial restriction digest","ssRNA-seq"," Strand-specific RNA sequencing."]
["METATRANSCRIPTOMIC"," Transcription products from community targets","MF"," Methyl Filtrated","miRNA-Seq"," Micro RNA sequencing strategy designed to capture post-transcriptional RNA elements and include non-coding functional elements. (see pubmed 21787409 for details)"]
["SYNTHETIC"," Synthetic DNA.","repeat fractionation"," Selection for less repetitive (and more gene rich) sequence through Cot filtration (CF) or other fractionation techniques based on DNA kinetics.","ncRNA-Seq"," Capture of other non-coding RNA types, including post-translation modification types such as snRNA (small nuclear RNA) or snoRNA (small nucleolar RNA), or expression regulation types such as siRNA (small interfering RNA) or piRNA/piwi/RNA (piwi-interacting RNA)."]
["VIRAL RNA"," Viral RNA.","size fractionation"," Physical selection of size appropriate targets.","FL-cDNA"," Full-length sequencing of cDNA templates"]
["OTHER"," Other, unspecified, or unknown library source material.","MSLL"," Methylation Spanning Linking Library","EST"," Single pass sequencing of cDNA templates"]
[null,null,"cDNA"," PolyA selection or enrichment for messenger RNA (mRNA); synonymize with PolyA","Hi-C"," Chromosome Conformation Capture technique where a biotin-labeled nucleotide is incorporated at the ligation junction, enabling selective purification of chimeric DNA ligation junctions followed by deep sequencing."]
[null,null,"cDNA_randomPriming","No description","ATAC-seq"," Assay for Transposase-Accessible Chromatin (ATAC) strategy is used to study genome-wide chromatin accessibility. alternative method to DNase-seq that uses an engineered Tn5 transposase to cleave DNA and to integrate primer DNA sequences into the cleaved genomic DNA."]
[null,null,"cDNA_oligo_dT","No description","WCS"," Random sequencing of a whole chromosome or other replicon isolated from a genome."]
[null,null,"PolyA"," PolyA selection or enrichment for messenger RNA (mRNA); should replace cDNA enumeration.","RAD-Seq","No description"]
[null,null,"Oligo-dT"," enrichment of messenger RNA (mRNA) by hybridization to Oligo-dT.","CLONE"," Genomic clone based (hierarchical) sequencing."]
[null,null,"Inverse rRNA"," depletion of ribosomal RNA by oligo hybridization.","POOLCLONE"," Shotgun of pooled clones (usually BACs and Fosmids)."]
[null,null,"Inverse rRNA selection"," depletion of ribosomal RNA by inverse oligo hybridization.","AMPLICON"," Sequencing of overlapping or distinct PCR or RT-PCR products. For example, metagenomic community profiling using SSU rRNA."]
[null,null,"ChIP"," Chromatin immunoprecipitation","CLONEEND"," Clone end (5’, 3’, or both) sequencing."]
[null,null,"ChIP-Seq"," Chromatin immunoPrecipitation, reveals binding sites of specific proteins, typically transcription factors (TFs) using antibodies to extract DNA fragments bound to the target protein.","FINISHING"," Sequencing intended to finish (close) gaps in existing coverage."]
[null,null,"MNase"," Identifies well-positioned nucleosomes. uses Micrococcal Nuclease (MNase) is an endo-exonuclease that processively digests DNA until an obstruction, such as a nucleosome, is reached.","ChIP-Seq"," ChIP-seq, Chromatin ImmunoPrecipitation, reveals binding sites of specific proteins, typically transcription factors (TFs) using antibodies to extract DNA fragments bound to the target protein."]
[null,null,"DNase"," DNase I endonuclease digestion and size selection reveals regions of chromatin where the DNA is highly sensitive to DNase I.","MNase-Seq"," Identifies well-positioned nucleosomes. uses Micrococcal Nuclease (MNase) is an endo-exonuclease that processively digests DNA until an obstruction, such as a nucleosome, is reached."]
[null,null,"Hybrid Selection"," Selection by hybridization in array or solution.","DNase-Hypersensitivity"," Sequencing of hypersensitive sites, or segments of open chromatin that are more readily cleaved by DNaseI."]
[null,null,"Reduced Representation"," Reproducible genomic subsets, often generated by restriction fragment size selection, containing a manageable number of loci to facilitate re-sampling.","Bisulfite-Seq"," MethylC-seq. Sequencing following treatment of DNA with bisulfite to convert cytosine residues to uracil depending on methylation status."]
[null,null,"Restriction Digest"," DNA fractionation using restriction enzymes.","CTS"," Concatenated Tag Sequencing"]
[null,null,"5-methylcytidine antibody"," Selection of methylated DNA fragments using an antibody raised against 5-methylcytosine or 5-methylcytidine (m5C).","MRE-Seq"," Methylation-Sensitive Restriction Enzyme Sequencing."]
[null,null,"MBD2 protein methyl-CpG binding domain"," Enrichment by methyl-CpG binding domain.","MeDIP-Seq"," Methylated DNA Immunoprecipitation Sequencing."]
[null,null,"CAGE"," Cap-analysis gene expression.","MBD-Seq"," Methyl CpG Binding Domain Sequencing."]
[null,null,"RACE"," Rapid Amplification of cDNA Ends.","Tn-Seq"," Quantitatively determine fitness of bacterial genes based on how many times a purposely seeded transposon gets inserted into each gene of a colony after some time."]
[null,null,"MDA"," Multiple Displacement Amplification, a non-PCR based DNA amplification technique that amplifies a minute quantifies of DNA to levels suitable for genomic analysis.","VALIDATION","  CGHub special request:  Independent experiment to re-evaluate putative variants."]
[null,null,"padlock probes capture method"," Targeted sequence capture protocol covering an arbitrary set of nonrepetitive genomics targets. An example is capture bisulfite sequencing using padlock probes (BSPP).","FAIRE-seq"," Formaldehyde Assisted Isolation of Regulatory Elements. Reveals regions of open chromatin."]
[null,null,"other"," Other library enrichment, screening, or selection process.","SELEX"," Systematic Evolution of Ligands by Exponential enrichment"]
[null,null,"unspecified"," Library enrichment, screening, or selection is not specified.","RIP-Seq"," Direct sequencing of RNA immunoprecipitates (includes CLIP-Seq, HITS-CLIP and PAR-CLIP)."]
[null,null,null,null,"ChIA-PET"," Direct sequencing of proximity-ligated chromatin immunoprecipitates."]
[null,null,null,null,"Synthetic-Long-Read"," binning and barcoding of large DNA fragments to facilitate assembly of the fragment"]
[null,null,null,null,"Targeted-Capture"," Enrichment of a targeted subset of loci."]
[null,null,null,null,"Tethered Chromatin Conformation Capture"]
[null,null,null,null,"OTHER"," Library strategy not listed."]

{"sheet":"Version","index":2,"n_rows":7,"n_cols":3,"rows_kept":7,"cut":false,"hidden":false,"merged":[]}
["Date","Quoi","Qui"]
["2023-04-12T22:42:00"]
["2023-08-07T18:03:00","ajout infos pour metadata ENA (lib, espèce)","Gérald"]
["2023-08-24T19:12:00","Uniformisation cellules genome et transcriptome","Gérald"]
["2023-08-24T19:12:00","Uniformisation cellules genome et transcriptome","Gérald"]
["2023-09-29T15:37:00","précision remplir les infos de lib si RTL","Gérald"]
["2025-02-28T08:08:00","passage à 2784 echantillons\nAjout info pour conserver les échantillons ou non","Gérald"]

{"sheet":"Feuil1","index":3,"n_rows":0,"n_cols":0,"rows_kept":0,"cut":false,"hidden":true,"merged":[]}